{"text_format":"1","workbook":"xlsx","n_sheets":16,"sheets":["Cover Page","HIPAA Notice","Page 1","Pg 2 - Grp Size & Participa","Page 3 - Plan Info","Plan Info Lookups","Page 4 - Rates Insured","Page 4 - Rates ASO","Page 4 - Rates Minimum Premium","Page 5 - Agent-Signature pg","Page 6 - Reports (Internal)","Page 7 - ESA Agreement ","Nondiscrimination_Taglines","Page 8 - Acct Structure ","RX_ELIGIBILITY_LG_DROPDOWN (2)","Checklist"],"not_rendered":{"charts":0,"images":7,"macros":1,"external_links":1,"defined_names":47,"comments":6,"pivot_tables":0},"unopened":[],"bounds":{"document_bytes":16777216,"sheet_cells":100000,"rows_first":2000,"rows_last":500,"rows_between":2000,"halvings":0,"cell_chars":16384,"cell_head_chars":4096},"cells_cut":0,"cells_raw":0,"read":"whole","date_system":"1900"}

{"sheet":"Cover Page","index":0,"n_rows":39,"n_cols":8,"rows_kept":39,"cut":false,"hidden":false,"merged":[[2,0,2,9],[3,0,3,9],[38,7,38,8],[38,0,38,6]]}
[]
[]
["Welcome"]
["Thank you for choosing Moda Health and Delta Dental."]
[]
[]
["New Group Enrollment Checklist for Employers and Agents"]
[]
["Please forward the following to Moda Health and Delta Dental, Attn Sales and Account Services Department:"]
[]
[]
[null,"(include hire dates on all enrollment forms)"]
[]
[]
[]
{"$rows_left_out":25}
{"sheet":"HIPAA Notice","index":1,"n_rows":0,"n_cols":0,"rows_kept":0,"cut":false,"hidden":true,"merged":[]}

{"sheet":"Page 1","index":2,"n_rows":56,"n_cols":29,"rows_kept":56,"cut":false,"hidden":false,"merged":[[10,0,10,2],[16,11,16,13],[30,1,30,13],[19,11,19,13],[19,3,19,8],[13,3,13,8],[14,3,14,8],[17,11,17,13],[14,9,14,10],[13,9,13,10],[17,9,17,10],[17,3,17,8],[45,16,45,17],[39,8,39,13],[20,3,20,8],[40,9,40,10],[40,11,40,13],[40,5,40,7],[20,11,20,13],[4,3,4,4],[6,3,6,6],[55,4,55,13],[48,12,48,13],[52,12,52,13],[48,8,48,9],[18,3,18,8],[36,4,36,5],[9,3,9,12],[10,3,10,12],[33,6,33,13],[18,11,18,13],[31,1,31,11],[9,0,9,2],[16,3,16,8],[32,1,32,11]]}
[null,null,null,null,null,null,null,"ALASKA Large Employer Group Application (51+)",null,null,null,null,null,null,null,null,null,null,null,null,null,30,2]
[null,null,null,null,null,null,null,null,null,null,null,null,null,null,null,null,null,null,null,null,null,60,3]
[null,null,null,null,null,null,null,null,null,null,null,null,null,null,null,null,null,null,null,null,null,90,4]
[null,null,null,null,null,null,null,null,null,null,null,null,null,null,null,null,null,null,null,null,null,120,5]
[null,null,"EFFECTIVE DATE:",null,null,null,null,null,null,null,null,null,null,null,null,null,null,null,null,null,null,150,6]
[null,null,null,null,null,null,null,null,null,null,null,null,null,null,null,null,null,null,null,null,null,180,7]
[null,null,"TYPE:",null,null,null,null,null,null,null,null,null,null,null,null,null,null,null,null,null,null,210,8]
[null,null,null,null,null,null,null,null,null,null,null,null,null,null,null,null,null,null,null,null,null,240,9]
["GROUP INFORMATION:",null,null,null,null,null,null,null,null,null,null,null,null,null,null,null,null,null,null,null,null,270,10]
["Legal Name:"]
["Billing Name:"]
[null,null,null,null,null,null,null,null,null,null,null,null,null,null,null,null,null,null,null,null,30,60,90,120,150,180,210,240,270]
[null,null,null,null,null,null,null,null,null,null,null,null,null,null,null,null,null,null,null,"2014-01-01","2013-12-01","2013-11-01","2013-10-01","2013-09-01","2013-08-01","2013-07-01","2013-06-01","2013-05-01","2013-04-01"]
[null,null,"Street Address:",null,null,null,null,null,null,"City_________",null,"State__________","Zip",null,null,null,null,{"$f":"LEFT(N14,3)","v":""},null,"2014-02-01","2014-01-01","2013-12-01","2013-11-01","2013-10-01","2013-09-01","2013-08-01","2013-07-01","2013-06-01","2013-05-01"]
[null,null,"Billing Address:",null,null,null,null,null,null,"City_________",null,"State__________","Zip",null,null,null,null,{"$f":"LEFT(N15,3)","v":""},null,"2014-03-01","2014-02-01","2014-01-01","2013-12-01","2013-11-01","2013-10-01","2013-09-01","2013-08-01","2013-07-01","2013-06-01"]
{"$rows_left_out":42}
{"sheet":"Pg 2 - Grp Size & Participa","index":3,"n_rows":67,"n_cols":15,"rows_kept":67,"cut":false,"hidden":false,"merged":[[40,0,40,9],[41,0,41,9],[54,0,54,11],[56,10,57,10],[56,11,57,11],[52,11,53,11],[63,0,63,11],[42,0,42,9],[43,0,45,9],[43,10,45,10],[52,0,52,9],[52,10,53,10],[60,0,60,11],[18,0,18,9],[18,10,21,10],[19,0,19,9],[20,0,20,9],[38,11,39,11],[39,0,39,9],[38,0,38,9],[32,11,33,11],[34,0,35,9],[34,10,37,10],[34,11,37,11],[36,0,36,9],[37,0,37,9],[38,10,39,10],[32,0,33,9],[32,10,33,10],[21,0,21,9],[27,11,31,11],[28,0,28,9],[29,0,29,9],[30,0,30,9],[27,10,31,10],[22,10,24,10],[23,0,23,9],[24,0,24,9],[16,0,16,9],[16,10,17,10],[17,0,17,9],[10,0,10,9],[2,0,2,11],[5,0,5,11],[7,0,7,9],[8,0,8,9],[9,0,9,9],[3,0,3,11],[4,0,4,9],[4,10,4,11],[11,0,11,9],[11,10,12,10],[12,0,12,9]]}
[]
["ALASKA STANDARDIZED GROUP PROFILE FORM"]
["This form must be completed for all new and renewing groups to determine whether a group qualifies as a large employer. Moda Health must treat an employer as a large employer if the employer has a least 51 employees on average during the preceding calendar year and has at least one employee enrolled on the first day of the plan year."]
["Controlled and Affiliated Groups:"]
["Are you a Controlled Group?"]
["If you are a controlled or affiliated group of employers as described under subsection (b), (c), (m) or (o) of section 414 of the Internal Revenue Code of 1986, Moda Health must treat all employees within the affiliated group as a single group for purposes of determining group size. You must fill out one group profile form for the entire controlled group. If a controlled group is determined as a large employer, each affiliated employer is part of the large employer even if separately the employer would not meet the definition of a large employer. Therefore, each affiliated employer is considered a large group for the purposes of group determination.\n",null,null,null,null,null,null,null,null,null,null,null,null,null,"."]
["SECTION A"]
["Is this an employee only plan?"]
[]
["1.   On average, how many employees did the employer employ during the preceding calendar year?\nIf less than 1 enrolled, no Alaska large group exists, If 1 to 50, the group is a small group and not eligible as an Alaska large group. If more than 50, the group is a large group."]
[]
["2.   If an employer was not in existence through the preceding calendar year, what is the average number of employees the employer reasonably expects to employ on business days in the current calendar year?  \nIf less than 1 enrolled, no Alaska large group exists, If 1 to 50, the group is a small group and not eligible as an Alaska large group. If more than 50, the group is a large group."]
[]
[]
[]
{"$rows_left_out":53}
{"sheet":"Page 3 - Plan Info","index":4,"n_rows":404,"n_cols":112,"rows_kept":404,"cut":false,"hidden":false,"merged":[[27,1,27,2],[12,1,12,3],[13,0,13,1],[42,7,42,11],[42,2,42,5],[26,10,26,11],[28,9,28,11],[27,10,27,11],[25,8,25,11],[19,7,19,9],[22,1,22,3],[23,1,23,3],[25,5,25,7],[26,1,26,2],[15,1,15,4],[23,7,23,9],[52,8,52,10],[48,0,48,10],[50,9,50,11],[33,1,33,5],[49,9,49,11],[46,2,46,5],[44,2,44,5],[44,7,44,11],[46,7,46,11],[51,9,51,11],[47,0,47,9],[34,9,34,11],[2,8,2,11],[13,4,13,6],[13,9,13,11],[2,3,2,7],[6,9,6,11],[9,10,9,12],[11,11,11,12],[10,11,10,12],[5,8,5,9],[9,6,9,9],[7,1,7,4],[32,7,32,11],[3,10,3,11],[31,7,31,11],[14,9,14,11],[31,1,31,5],[9,2,9,5],[5,0,5,3],[5,4,5,6],[32,1,32,5],[18,1,18,3],[19,1,19,3],[4,10,4,11],[11,0,11,1],[4,0,4,1],[3,0,3,1],[10,0,10,1]]}
["Types of Coverage: "]
[]
["Medical:",null,null,"In-Network",null,null,null,null,"Out-of-Network",null,null,null,"Group Size"]
["Plan Design #",null,"Plan Type","Deductible","Co-ins.    %","Co-pay","Hospital Co-pay","Out-of-Pocket","Ded","Co-ins.    %","Out-of-Pocket",null,"Large"]
[null,null,{"$f":"IFERROR(VLOOKUP(LEFT(A5,1),'Plan Info Lookups'!$B$56:$C$63,2,FALSE),\"\")","v":""},{"$f":"IFERROR(VLOOKUP(MID(A5,5,1),'Plan Info Lookups'!$M$56:$N$76,2,FALSE),\"\")","v":""},{"$f":"IFERROR(VLOOKUP(MID(A5,6,1),'Plan Info Lookups'!$S$56:$T$63,2,FALSE),\"\")","v":""},{"$f":"IFERROR(VLOOKUP(MID(A5,3,2),'Plan Info Lookups'!$G$56:$H$65,2,FALSE),\"\")","v":""},{"$f":"IFERROR(VLOOKUP(MID(A5,6,1),'Plan Info Lookups'!$S$56:$T$63,2,FALSE),\"\")","v":""},{"$f":"IF(A5=\"\",\"\",IFERROR(VLOOKUP(MID(A5,7,2),'Plan Info Lookups'!$Z$56:$AA$92,2,FALSE),\"Error\"))","v":""},{"$f":"IFERROR(VLOOKUP(MID(A5,10,1),'Plan Info Lookups'!$M$56:$N$87,2,FALSE),\"\")","v":""},{"$f":"IFERROR(VLOOKUP(MID(A5,11,1),'Plan Info Lookups'!$S$56:$T$63,2,FALSE),\"\")","v":""},{"$f":"IFERROR(VLOOKUP(MID(A5,12,2),'Plan Info Lookups'!$Z$56:$AA$114,2,FALSE),\"\")","v":""},{"$f":"IF($A$5=\"\",\"\",IF(VLOOKUP($A$5,$EC$7:$EK$29880,1)=$A$5,VLOOKUP($A$5,$EC$7:$EK$29880,2),\"\"))","v":""}]
["Group will utilize the following Network:",null,null,null,null,null,null,null,"No",null,"Maximum Cost Share Wrap (in-net)"]
[null,"Modified Plan.  Please note changes in ITALICS & BOLD.  ",null,null,null,null,null,null,"Modified from Plan #:"]
[null,"GRANDFATHERED BENEFITS"]
[]
["Pharmacy:",null,"Retail",null,null,null,"Mail Order",null,null,null,"Retail & Mail Order - (Specify):",null,null,null,null,null,null,null,null,null,null,null,null,null,null,null,"","Add New Class",null,"Renewal",1]
["Plan #",null,"Value Co-pay","Select                 Co-pay","Preferred Co-pay","Brand Co-pay","Value Co-pay","Select              Co-pay","Preferred Co-pay","Brand Co-pay","Ded","Out-of-Pocket",null,null,null,null,null,null,null,null,null,null,null,null,null,null,null,"Add New Subgroup",null,"Renewal",1]
[null,null,{"$f":"IF($A$12=\"\",\"\",(IF(VLOOKUP($A$12,$AI$310:$AX$329,1,FALSE)=$A$12,VLOOKUP($A$12,$AI$310:$AX$329,14,FALSE),\"\")))","v":""},{"$f":"IF($A$12=\"\",\"\",(IF(VLOOKUP($A$12,$AI$310:$AX$329,1,FALSE)=$A$12,VLOOKUP($A$12,$AI$310:$AX$329,5,FALSE),\"\")))","v":""},{"$f":"IF($A$12=\"\",\"\",IF(VLOOKUP($A$12,$AI$310:$AX$329,1,FALSE)=$A$12,VLOOKUP($A$12,$AI$310:$AX$329,9,FALSE),\"\"))","v":""},{"$f":"IF($A$12=\"\",\"\",IF(VLOOKUP($A$12,$AI$310:$AX$329,1,FALSE)=$A$12,VLOOKUP($A$12,$AI$310:$AX$329,10,FALSE),\"\"))","v":""},{"$f":"IF($A$12=\"\",\"\",IF(VLOOKUP($A$12,$AI$310:$AX$329,1,FALSE)=$A$12,VLOOKUP($A$12,$AI$310:$AX$329,15,FALSE),\"\"))","v":""},{"$f":"IF($A$12=\"\",\"\",IF(VLOOKUP($A$12,$AI$310:$AX$329,1,FALSE)=$A$12,VLOOKUP($A$12,$AI$310:$AX$329,7,FALSE),\"\"))","v":""},{"$f":"IF($A$12=\"\",\"\",IF(VLOOKUP($A$12,$AI$310:$AX$329,1,FALSE)=$A$12,VLOOKUP($A$12,$AI$310:$AX$329,11,FALSE),\"\"))","v":""},{"$f":"IF($A$12=\"\",\"\",IF(VLOOKUP($A$12,$AI$310:$AX$329,1,FALSE)=$A$12,VLOOKUP($A$12,$AI$310:$AX$329,12,FALSE),\"\"))","v":""},{"$f":"IF($A$12=\"\",\"\",IF(VLOOKUP($A$12,$AI$310:$AX$329,1,FALSE)=$A$12,VLOOKUP($A$12,$AI$310:$AX$329,16,FALSE),\"\"))","v":""},{"$f":"IF($A$12=\"\",\"\",IF(I6=\"Yes- $6850/$13700\",\"See Max Cost Share\",IF(VLOOKUP($A$12,$AI$310:$AX$329,1,FALSE)=$A$12,VLOOKUP($A$12,$AI$310:$AX$329,13,FALSE),\"\")))","v":""},null,null,null,null,null,null,null,null,null,null,null,false,null,null,null,"Change",null,"Renewal",1]
[null,{"$f":"IF(A5=\"\",\"\",IF(LEFT(A5,1)=\"H\",\"HSA Plan Rx:\",\"\"))","v":""},null,null,{"$f":"IF(A5=\"\",\"\",IF(LEFT(A5,1)=\"H\",\"Deductible Applies, then \"&(E5),\"\"))","v":""},null,null,null,null,null,null,null,null,null,null,null,null,null,null,null,null,null,null,null,null,null,null,"Renewal",null,"Renewal",1]
["Contraceptive Coverage:",null,null,"Type of Coverage:",null,null,null,null,"Diabetic Supplies:",null,null,null,null,null,null,null,null,null,null,null,null,null,null,null,null,null,null,"NEW",null,"NEW",0]
[null,"Modified Plan.  Please note changes in ITALICS & BOLD.  ",null,null,null,null,null,null,"Modified from Plan #:",null,null,null,null,null,null,null,null,null,null,null,null,null,null,null,null,null,null,"Reinstate (include diary & renewal)",null,"Renewal",1]
{"$rows_left_out":390}
{"sheet":"Plan Info Lookups","index":5,"n_rows":114,"n_cols":30,"rows_kept":114,"cut":false,"hidden":true,"merged":[]}
[]
["Medical 11-Digit Plan Codes",null,null,null,null,null,"Yellow cells are drop down boxes.  Select your plan's benefit and 11 digit code will populate below."]
[]
[null,null,null,null,null,null,"Plan Type","OV Copay","In-Net Ded","In-Net Coins",null,"In-Net OOP",null,"Out Ded","Out Coins","Out OOP"]
[null,null,null,"Your Plan:",null,null,"PPO","$30","$2000","20%",null,"$3,000",null,"$2000","50%","$15,000"]
[]
[null,null,null,"Your Plan's Code:",null,null,{"$f":"IFERROR(VLOOKUP(G5,C56:D63,2,FALSE)&\"-\"&VLOOKUP(H5,H56:I63,2,FALSE)&VLOOKUP(I5,N56:O371,2,FALSE)&VLOOKUP(J5,T56:U63,2,FALSE)&VLOOKUP(L5,AA56:AB81,2,FALSE)&\"-\"&VLOOKUP(N5,N56:O78,2,FALSE)&VLOOKUP(O5,T56:U63,2,FALSE)&VLOOKUP(P5,AA56:AB96,2,FALSE),\"\")","v":""}]
[]
[null,null,null,"Your Plan's Description:",null,null,{"$f":"IF(G5=\"Beneficial PPO\",G5&\" : \"&H5&\"(5) OV, \"&I5&\" In-net Ded, \"&J5&\" (\"&L5&\")\"&\"; Out: \"&N5&\" Ded, \"&O5&\" (\"&P5&\")\",IF(G5=\"HSA PPO\",G5&\" : \"&I5&\" In-net Ded, \"&J5&\" (\"&L5&\")\"&\"; Out: \"&N5&\" Ded, \"&O5&\" (\"&P5&\")\",G5&\" : \"&H5&\" OV, \"&I5&\" In-net Ded, \"&J5&\" (\"&L5&\")\"&\"; Out: \"&N5&\" Ded, \"&O5&\" (\"&P5&\")\"))","v":"PPO : $30 OV, $2000 In-net Ded, 20% ($3,000); Out: $2000 Ded, 50% ($15,000)"}]
[]
[]
[]
[]
[]
[]
{"$rows_left_out":100}
{"sheet":"Page 4 - Rates Insured","index":6,"n_rows":37,"n_cols":7,"rows_kept":37,"cut":false,"hidden":false,"merged":[[6,2,6,3],[5,4,5,5],[15,6,15,8],[20,6,20,8],[18,6,18,8],[17,6,17,8],[14,6,14,8],[6,5,6,6],[8,6,8,8],[9,6,9,8],[10,6,10,8],[15,0,15,2],[0,0,1,8],[4,0,4,1],[4,2,4,3],[4,7,4,8],[3,4,3,5],[4,4,4,5],[31,0,31,3],[33,4,33,8],[31,4,31,8],[29,4,29,8],[26,6,26,8],[29,0,29,3],[28,0,28,2],[36,4,36,8],[33,0,33,3],[34,0,34,3],[35,0,35,3],[36,0,36,3],[34,4,34,8],[35,4,35,8],[21,0,21,2],[21,6,21,8],[19,6,19,8],[16,0,16,2],[11,6,11,8],[12,6,12,8],[13,6,13,8],[20,0,20,2],[16,6,16,8]]}
["RATE INFORMATION - Insured"]
[]
[]
["Funding Type:"]
["Rate Structure:"]
["Rating Area:",null,null,null,{"$f":"IFERROR(IF(VLOOKUP('Page 1'!#REF!,#REF!,1,FALSE)='Page 1'!#REF!,VLOOKUP('Page 1'!#REF!,#REF!,2,FALSE)),\"\")","v":""}]
["Effective Date: ",null,"",null,"Ending Date:",{"$f":"IF(C7=\"\",\"\",(C7+364))","v":""}]
[]
["RATES",null,null,{"$f":"IF(E5=\"\",\"\",IF(E5=\"4 Tier\",\"EE Only\",IF(E5=\"3 Tier\",\"Emp Only\",IF(E5=\"Composite\",\"\",IF(E5=\"ASO\",\"\",IF(E5=\"Other-see comments\",\"\"))))))","v":""},{"$f":"IF(E5=\"\",\"\",IF(E5=\"4 Tier\",\"EE + SP\",IF(E5=\"3 Tier\",\"Emp + 1\",IF(E5=\"Composite\",\"\",IF(E5=\"ASO\",\"\",IF(E5=\"Other-see comments\",\"\"))))))","v":""},{"$f":"IF(E5=\"\",\"\",IF(E5=\"4 Tier\",\"EE + Family\",IF(E5=\"3 Tier\",\"Emp + 2 or more\",IF(E5=\"Composite\",\"\",IF(E5=\"ASO\",\"\",IF(E5=\"Other-see comments\",\"\"))))))","v":""},{"$f":"IF(E5=\"\",\"\",IF(E5=\"4 Tier\",\"EE + Child(ren)\",IF(E5=\"3 Tier\",\"\",IF(E5=\"Composite\",\"\",IF(E5=\"ASO\",\"\",IF(E5=\"Other-see comments\",\"\"))))))","v":""}]
["Employee Counts"]
["Medical rate"]
["RX Buy Up rate"]
["Hearing Aid Rider"]
["Vision rate"]
["Wellness Services rate"]
{"$rows_left_out":23}
{"sheet":"Page 4 - Rates ASO","index":7,"n_rows":77,"n_cols":6,"rows_kept":77,"cut":false,"hidden":false,"merged":[[44,1,44,2],[0,0,1,10],[2,0,2,1],[2,2,2,3],[2,5,2,7],[2,9,2,10],[4,9,4,10],[6,5,6,6],[11,5,11,6],[26,1,26,2],[27,1,27,2],[41,5,41,6],[63,0,63,3],[63,4,63,9],[45,1,45,2],[50,5,50,6],[52,12,52,14],[57,0,57,9],[58,0,58,3],[58,4,58,9],[58,11,58,14],[59,0,59,3],[59,4,59,9],[61,5,61,9],[62,0,62,3],[62,4,62,9],[73,0,73,3],[73,4,73,7],[64,0,64,9],[65,2,65,7],[66,2,66,7],[67,2,67,7],[68,2,68,7],[69,2,69,7],[72,0,72,3],[72,4,72,7],[74,0,74,3],[74,4,74,7],[75,0,75,3],[75,4,75,7],[76,0,76,3],[76,4,76,7]]}
["RATE INFORMATION - ASO"]
[]
["Effective Date: ",null,null,null,"Ending Date:"]
[]
["RATES"]
[null,null,null,null,null,"Amount:"]
["Dental",null,null,null,null,"PEPM"]
["Administration:"]
["Commission:"]
["Total:",null,null,null,null,{"$f":"SUM(F8:F9)","v":0}]
[]
["Medical ",null,null,null,null,"PEPM"]
["Administration:"]
["PPO Access Fee"]
["Commission:"]
{"$rows_left_out":63}
{"sheet":"Page 4 - Rates Minimum Premium","index":8,"n_rows":42,"n_cols":9,"rows_kept":42,"cut":false,"hidden":true,"merged":[[9,7,9,8],[28,7,28,8],[24,7,24,8],[27,7,27,8],[25,7,25,8],[26,7,26,8],[19,7,19,8],[18,7,18,8],[13,7,13,8],[10,7,10,8],[22,0,22,8],[24,0,24,2],[5,7,5,8],[6,7,6,8],[7,7,7,8],[8,7,8,8],[0,0,1,8],[3,0,3,1],[3,2,3,3],[3,7,3,8],[41,0,41,3],[41,4,41,8],[38,0,38,2],[39,0,39,3],[39,4,39,8],[40,0,40,3],[40,4,40,8],[30,0,30,2],[31,0,31,2],[30,7,30,8],[31,7,31,8],[32,7,32,8],[33,7,33,8],[34,7,34,8],[11,7,11,8],[12,7,12,8],[14,7,14,8],[16,7,16,8],[15,7,15,8],[17,7,17,8],[29,7,29,8]]}
["RATE INFORMATION - Minimum Premium"]
[]
[]
["Rate Structure:",null,null,null,"Effective Date:",null,"Ending Date:"]
[]
["RATES",null,null,{"$f":"IF(C4=\"\",\"\",IF(C4=\"4 Tier\",\"EE\",IF(C4=\"3 Tier\",\"Emp Only\",IF(C4=\"Composite\",\"PEPM\",IF(C4=\"ASO\",\"PEPM\",IF(C4=\"Other-see comments\",\"\"))))))","v":""},{"$f":"IF(C4=\"\",\"\",IF(C4=\"4 Tier\",\"EE + SP\",IF(C4=\"3 Tier\",\"Emp + 1\",IF(C4=\"Composite\",\"\",IF(C4=\"ASO\",\"\",IF(C4=\"Other-see comments\",\"\"))))))","v":""},{"$f":"IF(C4=\"\",\"\",IF(C4=\"4 Tier\",\"EE + Family\",IF(C4=\"3 Tier\",\"Emp + 2 or more\",IF(C4=\"Composite\",\"\",IF(C4=\"ASO\",\"\",IF(C4=\"Other-see comments\",\"\"))))))","v":""},{"$f":"IF(C4=\"\",\"\",IF(C4=\"4 Tier\",\"EE + Child(ren)\",IF(C4=\"3 Tier\",\"\",IF(C4=\"Composite\",\"\",IF(C4=\"ASO\",\"\",IF(C4=\"Other-see comments\",\"\"))))))","v":""},"Total"]
["Employee Counts",null,null,null,null,null,null,{"$f":"SUM(D7:G7)","v":0}]
["Medical Min. Premium Rate",null,null,null,null,null,null,{"$f":"($D$7*D8)+($E$7*E8)+($F$7*F8)+($G$7*G8)","v":0}]
["Medical MCL Premium Rate",null,null,null,null,null,null,0]
["Rx Min. Premium Rate",null,null,null,null,null,null,0]
["Rx MCL Premium Rate",null,null,null,null,null,null,0]
["Vision Min. Premium Rate",null,null,null,null,null,null,0]
["Vision MCL Premium Rate",null,null,null,null,null,null,0]
["SUBTOTAL MEDICAL",null,null,{"$f":"SUM(D8:D9)","v":0},{"$f":"SUM(E8:E9)","v":0},{"$f":"SUM(F8:F9)","v":0},{"$f":"SUM(G8:G9)","v":0},{"$f":"SUM(H8:I13)","v":0}]
["Dental Min. Premium Rate",null,null,null,null,null,null,{"$f":"($D$7*D15)+($E$7*E15)+($F$7*F15)+($G$7*G15)","v":0}]
{"$rows_left_out":28}
{"sheet":"Page 5 - Agent-Signature pg","index":9,"n_rows":41,"n_cols":31,"rows_kept":41,"cut":false,"hidden":false,"merged":[[0,0,0,10],[38,5,38,6],[31,5,31,6],[33,0,33,3],[35,5,35,6],[3,2,3,5],[36,5,36,6],[22,0,23,10],[3,7,3,10],[4,2,4,5],[11,0,14,10],[16,0,19,10],[2,2,2,5],[2,7,2,10]]}
["AGENT INFORMATION"]
[]
["Agent Name",null,"",null,null,null,"Tax ID #",""]
["Agency",null,"",null,null,null,"License #",""]
["NPN",null,null,null,null,null,null,null,null,null,null,"",null,null,null,null,null,null,null,null,null,null,null,null,null,"AGENT 1",7,8,null,"Tax ID / SS #",11]
[null,null,null,null,null,null,null,null,null,null,null,null,null,null,null,null,null,null,null,null,null,null,null,null,null,"Agency",9,null,null,"Phone #",20]
[null,null,null,null,null,null,null,null,null,null,null,null,null,null,null,null,null,null,null,null,null,null,null,null,null,"Comm. Address",18,null,null,"Fax #",21]
[null,null,null,null,null,null,null,null,null,null,null,null,null,null,null,null,null,null,null,null,null,null,null,null,null,"City/St/Zip",19,null,null,"Email Address",22]
[null,null,null,null,null,null,null,null,"Split Commission Amount:",null,null,null,null,null,null,null,null,null,null,null,null,null,null,null,null,"Physical Address",12,null,null,"License #",23]
[null,null,null,null,null,null,null,null,null,null,null,null,null,null,null,null,null,null,null,null,null,null,null,null,null,"City/St/Zip",13,14,15,null,"Split Commission"]
[]
["I hereby make application to Moda Health/Delta Dental, on behalf of the Group, for the Group Policies indicated in this group application.  I understand that there is no coverage in effect until Moda Health/Delta Dental accepts this Application and premium deposit and establishes an effective date.  If this Application is not accepted, the premium deposit will be refunded."]
[]
[]
[]
{"$rows_left_out":27}
{"sheet":"Page 6 - Reports (Internal)","index":10,"n_rows":36,"n_cols":7,"rows_kept":36,"cut":false,"hidden":true,"merged":[[33,2,33,3],[0,0,0,6],[29,2,29,6]]}
["REPORTS"]
["Medical","51-100","100-300","300-999","1000+","To \n(Group/\nAgent)","CC \n(Group/\nAgent)"]
["Activity","N/A","M","M","M"]
["Large Claims","N/A","M","M","M"]
["Case Management","N/A","M","M","M"]
["Income-Cost Experience","N/A","N/A","Annual\n(Refunding)","Annual\n(Refunding)"]
["Lag Report (see below)","N/A","N/A","M (ASO)","M (ASO)"]
["Schedule A, form 5500 (fully-insured groups)","N/A","A","A","A"]
["CM2 ","N/A","M","M","M"]
["Actuarial Cost and Utilization Analysis","N/A","N/A","A","A"]
[]
["Pharmacy","51-100","100-300","300-999","1000+","To \nGroup","To \nAgent"]
["RX Report","N/A","Q","Q","Q"]
[]
["Dental","51-100","100-300","300-999","1000+","To \nGroup","To \nAgent"]
{"$rows_left_out":22}
{"sheet":"Page 7 - ESA Agreement ","index":11,"n_rows":0,"n_cols":0,"rows_kept":0,"cut":false,"hidden":false,"merged":[]}

{"sheet":"Nondiscrimination_Taglines","index":12,"n_rows":0,"n_cols":0,"rows_kept":0,"cut":false,"hidden":false,"merged":[]}

{"sheet":"Page 8 - Acct Structure ","index":13,"n_rows":48,"n_cols":7,"rows_kept":48,"cut":false,"hidden":false,"merged":[[0,1,0,8],[35,2,35,5],[38,2,38,7],[27,1,27,8],[12,2,12,5],[10,2,10,5],[14,2,14,5],[4,3,4,8],[6,2,6,4],[7,2,7,4],[2,1,2,8],[3,2,3,4],[3,6,3,8],[47,1,47,8],[7,6,7,8],[6,6,6,8],[5,6,5,8],[5,3,5,4],[15,1,15,8],[29,2,29,5],[31,2,31,5],[33,2,33,5]]}
[null,"Account Structure Worksheet"]
[null,null,"Cobra"]
[null,"Moda Health subsidiary, BenefitHelp Solutions (BHS), provides COBRA Administration at no additional cost to Moda Health Medical Groups or Moda Health Medical Groups with Delta Dental of Alaska with 51-99 members.  Fees will apply to groups with 100+ eligible.  If electing to use BHS to administer your COBRA, mark Yes for question 9b."]
[null,"9.","Does the group use a TPA for COBRA or Retiree Administration? ",null,null," (Y/N):"]
[null,"9a.","If yes, enter TPA name:"]
[null,null,"Phone:",null,null,"Contact:"]
[null,"9b","If no, will the group elect COBRA administration through BenefitHelp Solutions (BHS)?                                                                                                                      (Y/N):  "]
[null,"9c","Who will be paying the COBRA premiums?"]
[]
[null,"     Billing "]
[null,"1.","Are billing statements sent to multiple locations? If yes, please list each location and their billing address below."]
[null,null,null,null,null,null," (Y/N):"]
[null,"2.","Will the group need the members separated on the invoice?"]
[null,null,null,null,null,null," (Y/N):"]
[null,null,"If yes, please be sure to indicate the subgroup that each member belongs to on their enrollment form.  Please list these subgroups below."]
{"$rows_left_out":34}
{"sheet":"RX_ELIGIBILITY_LG_DROPDOWN (2)","index":14,"n_rows":18,"n_cols":5,"rows_kept":18,"cut":false,"hidden":true,"merged":[]}
[]
["Discount Card",null,null,null,"Date of Hire"]
["Modified",null,null,null,"1st of the month after DOH or DOH when 1st of the month"]
["RX01525502XC90",null,null,null,"1st of the month after DOH or DOH when 1st of the month plus one month orientation period"]
["RX01535502XC90",null,null,null,"30 days"]
["RX1020%502XC90",null,null,null,"30 days plus one month orientation period"]
["RX1020502XC90",null,null,null,"60 days"]
["RX1025502XC90",null,null,null,"60 days plus one month orientation period"]
["RX1525$502XC90",null,null,null,"90 days (dental only)"]
["RX1525502XC90",null,null,null,"90 days plus one month orientation period (dental only)"]
["RX15502XC90"]
["RX250D15DW25502XC90"]
["RX25CA90"]
["RX30CA90"]
["RX35CA90"]
{"$rows_left_out":4}
{"sheet":"Checklist","index":15,"n_rows":33,"n_cols":9,"rows_kept":33,"cut":false,"hidden":true,"merged":[[25,6,25,7],[20,0,20,3],[25,0,25,3],[22,8,22,9],[33,4,33,9],[27,8,27,9],[26,8,26,9],[32,4,32,9],[28,0,28,3],[28,4,28,5],[26,0,26,3],[26,6,26,7],[27,6,27,7],[28,6,28,7],[32,0,32,2],[27,4,27,5],[26,4,26,5],[30,0,30,9],[28,8,28,9],[31,4,31,9],[0,0,0,10],[18,0,18,10],[2,4,2,5],[2,8,2,9],[3,0,3,3],[7,0,9,9],[2,6,2,7],[3,6,3,7],[3,4,3,5],[3,8,3,9],[5,0,5,3],[4,8,4,9],[4,0,4,3],[4,4,4,5],[4,6,4,7],[5,6,5,7],[21,6,21,7],[25,4,25,5],[21,4,21,5],[27,0,27,3],[5,8,5,9],[5,4,5,5],[11,0,12,9],[22,0,22,3],[22,4,22,5],[21,0,21,2],[20,4,20,5],[20,6,20,7],[21,8,21,9],[22,6,22,7],[20,8,20,9],[25,8,25,9],[24,0,24,3]]}
["NEW & RENEWALS"]
["THE GROUP PLAN IS BEST DEFINED AS "]
[null,null,null,null,"Medical",null,"Pharmacy",null,"Dental"]
["ODS STANDARD PLAN - Group accepts contract comparison changes effective under plans pertaining to Medical (all 4-digit plans (2-50) and all 11- digit plans (51+)) and Dental (all plans)."]
["NON-STANDARD PLAN - Group does not accept all contract comparison changes effective under standard plans.  Intended benefits fall within the variables filed with the state and group is defined as a non-standard ODS plan.  If unknown, verify plan type with Contract Department."]
["NEGOTIATED PLAN - Group does not accept all contract comparison changes effective under standard plans.  Benefit design is unique to ODS and group plan is defined as a negotiated plan.  If unknown, verify plan type with Contract Department."]
[]
["PLEASE NOTE: Management approval is required for: 1) New groups with less than 100 employees/primary subscribers enrolled requesting a non-standard or negotiated plan, 2) Existing groups with less than 100 employees/primary subscribers enrolled switching."]
[]
[]
[]
["Management approval is not required for existing groups currently on a non-standard or negotiated plan to continue on a non-standard or negotiated plan."]
[]
[]
["Marketing Management Approval ",null,null,"Date"]
{"$rows_left_out":18}